Reaction Details
TargetMu-type opioid receptor
LigandBDBM50312856
Substrate/Competitorn/a
Meas. Tech.ChEMBL_615875 (CHEMBL1102709)
Ki 139±n/a nM
Citation Ballet, SMarczak, EDFeytens, DSalvadori, SSasaki, YAbell, ADLazarus, LHBalboni, GTourwé, D Novel multiple opioid ligands based on 4-aminobenzazepinone (Aba), azepinoindole (Aia) and tetrahydroisoquinoline (Tic) scaffolds. Bioorg Med Chem Lett20:1610-3 (2010) 
 
Mu-type opioid receptor
Name:Mu-type opioid receptor
Type:G Protein-Coupled Receptor (GPCR)
Mol. Mass.:44503.11
Organism:Rattus norvegicus (rat)
Description:Competition binding assays were carried out using membrane preparations from transfected HN9.10 cells that constitutively expressed the mu opioid receptor.
Residue:398
BDBM50312856
NameBDBM50312856
Synonyms:(2S,2'S)-N,N'-((4R,4'R)-2,2'-(2,2'-(ethane-1,2-diylbis(azanediyl))bis(2-oxoethane-2,1-diyl))bis(3-oxo-1,2,3,4,5,10-hexahydroazepino[3,4-b]indole-4,2-diyl))bis(2-amino-3-(4-hydroxy-2,6-dimethylphenyl)propanamide) | CHEMBL1076738
TypeSmall organic molecule
Emp. Form.C52H60N10O8
Mol. Mass.953.095
SMILESCc1cc(O)cc(C)c1C[C@H](N)C(=O)N[C@@H]1Cc2c(CN(CC(=O)NCCNC(=O)CN3Cc4[nH]c5ccccc5c4C[C@@H](NC(=O)[C@@H](N)Cc4c(C)cc(O)cc4C)C3=O)C1=O)[nH]c1ccccc21