Reaction Details
TargetDelta-type opioid receptor
LigandBDBM50312854
Substrate/Competitorn/a
Meas. Tech.ChEMBL_615881 (CHEMBL1102715)
IC50>10000±n/a nM
Citation Ballet, SMarczak, EDFeytens, DSalvadori, SSasaki, YAbell, ADLazarus, LHBalboni, GTourwé, D Novel multiple opioid ligands based on 4-aminobenzazepinone (Aba), azepinoindole (Aia) and tetrahydroisoquinoline (Tic) scaffolds. Bioorg Med Chem Lett20:1610-3 (2010) 
 
Delta-type opioid receptor
Name:Delta-type opioid receptor
Type:Enzyme Catalytic Domain
Mol. Mass.:40577.25
Organism:MOUSE
Description:P32300
Residue:372
BDBM50312854
NameBDBM50312854
Synonyms:(S,3S,3'S)-N,N'-(ethane-1,2-diyl)bis(2-((S)-2-amino-3-(4-hydroxy-2,6-dimethylphenyl)propanoyl)-1,2,3,4-tetrahydroisoquinoline-3-carboxamide) | CHEMBL1076736
TypeSmall organic molecule
Emp. Form.C44H52N6O6
Mol. Mass.760.9203
SMILESCc1cc(O)cc(C)c1C[C@H](N)C(=O)N1Cc2ccccc2C[C@H]1C(=O)NCCNC(=O)[C@@H]1Cc2ccccc2CN1C(=O)[C@@H](N)Cc1c(C)cc(O)cc1C