Reaction Details
TargetProstaglandin D2 receptor 2
LigandBDBM50312914
Substrate/Competitorn/a
Meas. Tech.ChEMBL_615898 (CHEMBL1102912)
IC50 1.5±n/a nM
Citation Grimstrup, MReceveur, JMRist, ØFrimurer, TMNielsen, PAMathiesen, JMHögberg, T Exploration of SAR features by modifications of thiazoleacetic acids as CRTH2 antagonists. Bioorg Med Chem Lett20:1638-41 (2010) 
 
Prostaglandin D2 receptor 2
Name:Prostaglandin D2 receptor 2
Type:Enzyme
Mol. Mass.:43295.45
Organism:Homo sapiens (Human)
Description:Q9Y5Y4
Residue:395
BDBM50312914
NameBDBM50312914
Synonyms:2-(4-(4-fluorophenyl)-2-(phenyl(pyridin-3-yl)amino)thiazol-5-yl)acetic acid | CHEMBL1087501
TypeSmall organic molecule
Emp. Form.C22H16FN3O2S
Mol. Mass.405.445
SMILESOC(=O)Cc1sc(nc1-c1ccc(F)cc1)N(c1ccccc1)c1cccnc1