Reaction Details
TargetProstaglandin D2 receptor 2
LigandBDBM50312916
Substrate/Competitorn/a
Meas. Tech.ChEMBL_615898 (CHEMBL1102912)
IC50 1±n/a nM
Citation Grimstrup, MReceveur, JMRist, ØFrimurer, TMNielsen, PAMathiesen, JMHögberg, T Exploration of SAR features by modifications of thiazoleacetic acids as CRTH2 antagonists. Bioorg Med Chem Lett20:1638-41 (2010) 
 
Prostaglandin D2 receptor 2
Name:Prostaglandin D2 receptor 2
Type:Enzyme
Mol. Mass.:43295.45
Organism:Homo sapiens (Human)
Description:Q9Y5Y4
Residue:395
BDBM50312916
NameBDBM50312916
Synonyms:3-(2-(bis(4-fluorophenyl)methyl)-4-(3-fluorophenyl)thiazol-5-yl)propanoic acid | CHEMBL1088727
TypeSmall organic molecule
Emp. Form.C25H18F3NO2S
Mol. Mass.453.476
SMILESOC(=O)CCc1sc(nc1-c1cccc(F)c1)C(c1ccc(F)cc1)c1ccc(F)cc1