Reaction Details
TargetProstaglandin D2 receptor 2
LigandBDBM50312906
Substrate/Competitorn/a
Meas. Tech.ChEMBL_615898 (CHEMBL1102912)
IC50 0.012000±n/a nM
Citation Grimstrup, MReceveur, JMRist, ØFrimurer, TMNielsen, PAMathiesen, JMHögberg, T Exploration of SAR features by modifications of thiazoleacetic acids as CRTH2 antagonists. Bioorg Med Chem Lett20:1638-41 (2010) 
 
Prostaglandin D2 receptor 2
Name:Prostaglandin D2 receptor 2
Type:Enzyme
Mol. Mass.:43295.45
Organism:Homo sapiens (Human)
Description:Q9Y5Y4
Residue:395
BDBM50312906
NameBDBM50312906
Synonyms:2-(2-(bis(4-fluorophenyl)methyl)-4-(3-fluorophenyl)pyrimidin-5-yl)acetic acid | CHEMBL1088284
TypeSmall organic molecule
Emp. Form.C25H17F3N2O2
Mol. Mass.434.4099
SMILESOC(=O)Cc1cnc(nc1-c1cccc(F)c1)C(c1ccc(F)cc1)c1ccc(F)cc1