Reaction Details
TargetNon-receptor tyrosine-protein kinase TYK2
LigandBDBM50312987
Substrate/Competitorn/a
Meas. Tech.ChEMBL_616104 (CHEMBL1102773)
IC50 120±n/a nM
Citation Gerspacher, MFuret, PPissot-Soldermann, CGaul, CHolzer, PVangrevelinghe, ELang, MErdmann, DRadimerski, TRegnier, CHChene, PDe Pover, AHofmann, FBaffert, FBuhl, TAichholz, RBlasco, FEndres, RTrappe, JDrueckes, P 2-Amino-aryl-7-aryl-benzoxazoles as potent, selective and orally available JAK2 inhibitors. Bioorg Med Chem Lett20:1724-7 (2010) 
 
Non-receptor tyrosine-protein kinase TYK2
Name:Non-receptor tyrosine-protein kinase TYK2
Type:Protein
Mol. Mass.:133666.03
Organism:Homo sapiens (Human)
Description:P29597
Residue:1187
BDBM50312987
NameBDBM50312987
Synonyms:4-(7-(3,5-difluoro-4-(morpholinomethyl)phenyl)benzo[d]oxazol-2-ylamino)-N,2-dimethylbenzamide | CHEMBL1082022
TypeSmall organic molecule
Emp. Form.C27H26F2N4O3
Mol. Mass.492.5171
SMILESCNC(=O)c1ccc(Nc2nc3cccc(-c4cc(F)c(CN5CCOCC5)c(F)c4)c3o2)cc1C