Reaction Details
TargetAcetylcholinesterase
LigandBDBM50313093
Substrate/Competitorn/a
Meas. Tech.ChEMBL_616425 (CHEMBL1100711)
Ki 140±n/a nM
Citation Musilek, KKomloova, MZavadova, VHolas, OHrabinova, MPohanka, MDohnal, VNachon, FDolezal, MKuca, KJung, YS Preparation and in vitro screening of symmetrical bispyridinium cholinesterase inhibitors bearing different connecting linkage-initial study for Myasthenia gravis implications. Bioorg Med Chem Lett20:1763-6 (2010) 
 
Acetylcholinesterase
Name:Acetylcholinesterase
Type:Enzyme
Mol. Mass.:67792.70
Organism:Homo sapiens (Human)
Description:P22303
Residue:614
BDBM50313093
NameBDBM50313093
Synonyms:1,1'-bis(pyridinium)-naphtyl-3,6-dimethylene dibromide | CHEMBL1081810
TypeSmall organic molecule
Emp. Form.C22H20N2
Mol. Mass.312.4065
SMILESC(c1ccc2ccc(C[n+]3ccccc3)cc2c1)[n+]1ccccc1