Reaction Details
TargetEstrogen receptor
LigandBDBM50313148
Substrate/Competitorn/a
Meas. Tech.ChEMBL_616600 (CHEMBL1100140)
Ki 29000±n/a nM
Citation Mita, YDodo, KNoguchi-Yachide, TMiyachi, HMakishima, MHashimoto, YIshikawa, M LXXLL peptide mimetics as inhibitors of the interaction of vitamin D receptor with coactivators. Bioorg Med Chem Lett20:1712-7 (2010) 
 
Estrogen receptor
Name:Estrogen receptor
Type:Protein
Mol. Mass.:66230.44
Organism:Homo sapiens (Human)
Description:P03372
Residue:595
BDBM50313148
NameBDBM50313148
Synonyms:CHEMBL1087884 | N2,N4,6-triisobutylpyrimidine-2,4-diamine
TypeSmall organic molecule
Emp. Form.C16H30N4
Mol. Mass.278.4362
SMILESCC(C)CNc1cc(CC(C)C)nc(NCC(C)C)n1