Reaction Details
TargetOrexin receptor type 2
LigandBDBM50313172
Substrate/Competitorn/a
Meas. Tech.ChEMBL_616817 (CHEMBL1099401)
IC50 3±n/a nM
Citation Sifferlen, TBoss, CCottreel, EKoberstein, RGude, MAissaoui, HWeller, TGatfield, JBrisbare-Roch, CJenck, F Novel pyrazolo-tetrahydropyridines as potent orexin receptor antagonists. Bioorg Med Chem Lett20:1539-42 (2010) 
 
Orexin receptor type 2
Name:Orexin receptor type 2
Type:Protein
Mol. Mass.:50710.53
Organism:Homo sapiens (Human)
Description:O43614
Residue:444
BDBM50313172
NameBDBM50313172
Synonyms:(R)-2-((S)-1-ethyl-4-(4-ethylphenethyl)-3-methyl-6,7-dihydro-1H-pyrazolo[4,3-c]pyridin-5(4H)-yl)-N-methyl-2-phenylacetamide | CHEMBL1081210
TypeSmall organic molecule
Emp. Form.C28H36N4O
Mol. Mass.444.6116
SMILESCCc1ccc(CC[C@@H]2N(CCc3c2c(C)nn3CC)[C@@H](C(=O)NC)c2ccccc2)cc1