Reaction Details
TargetProstaglandin E synthase
LigandBDBM50006805
Substrate/Competitorn/a
Meas. Tech.ChEMBL_616833 (CHEMBL1100217)
IC50 1600±n/a nM
Citation Wang, JLimburg, DCarter, JMbalaviele, GGierse, JVazquez, M Selective inducible microsomal prostaglandin E(2) synthase-1 (mPGES-1) inhibitors derived from an oxicam template. Bioorg Med Chem Lett20:1604-9 (2010) 
 
Prostaglandin E synthase
Name:Prostaglandin E synthase
Type:Protein
Mol. Mass.:17112.22
Organism:Homo sapiens (Human)
Description:n/a
Residue:152
BDBM50006805
NameBDBM50006805
Synonyms:3-(1-(4-chlorobenzyl)-3-(tert-butylthio)-5-isopropyl-1H-indol-2-yl)-2,2-dimethylpropanoic acid 3-[1-(4-chlorobenzyl)-3-t-butyl-thio-5-isopropylindol-2-yl]-2,2-dimethylpropanoic acid CHEMBL29097 MK886 | cid_3651377
TypeSmall organic molecule
Emp. Form.C27H34ClNO2S
Mol. Mass.472.082
SMILESCC(C)c1ccc2n(Cc3ccc(Cl)cc3)c(CC(C)(C)C(O)=O)c(SC(C)(C)C)c2c1