Reaction Details
TargetMu-type opioid receptor
LigandBDBM50313229
Substrate/Competitorn/a
Meas. Tech.ChEMBL_616849 (CHEMBL1100233)
Ki 17±n/a nM
Citation Fulton, BSKnapp, BLBidlack, JMNeumeyer, JL Effect of linker substitution on the binding of butorphan univalent and bivalent ligands to opioid receptors. Bioorg Med Chem Lett20:1507-9 (2010) 
 
Mu-type opioid receptor
Name:Mu-type opioid receptor
Type:G Protein-Coupled Receptor (GPCR)
Mol. Mass.:44789.51
Organism:Homo sapiens (Human)
Description:P35372
Residue:400
BDBM50313229
NameBDBM50313229
Synonyms:(1R,9R,10R)-17-(cyclobutylmethyl)-4-[(6-{[(1R,9R,10R)-17-(cyclobutylmethyl)-17-azatetracyclo[7.5.3.0^{1,10}.0^{2,7}]heptadeca-2,4,6-trien-4-yl]oxy}-2,5-dihydroxyhexyl)oxy]-17-azatetracyclo[7.5.3.0^{1,10}.0^{2,7}]heptadeca-2,4,6-triene | CHEMBL1076574
TypeSmall organic molecule
Emp. Form.C48H68N2O4
Mol. Mass.737.0645
SMILESOC(CCC(O)COc1ccc2C[C@@H]3[C@@H]4CCCC[C@]4(CCN3CC3CCC3)c2c1)COc1ccc2C[C@@H]3[C@@H]4CCCC[C@]4(CCN3CC3CCC3)c2c1