Reaction Details
TargetSphingosine 1-phosphate receptor 1
LigandBDBM50313315
Substrate/Competitorn/a
Meas. Tech.ChEMBL_617125 (CHEMBL1101383)
EC50>20000±n/a nM
Citation Crosignani, SBombrun, ACovini, DMaio, MMarin, DQuattropani, ASwinnen, DSimpson, DSauer, WFrançon, BMartin, TCambet, YNichols, AMartinou, IBurgat-Charvillon, FRivron, DDonini, CSchott, OEligert, VNovo-Perez, LVitte, PAArrighi, JF Discovery of a novel series of potent S1P1 agonists. Bioorg Med Chem Lett20:1516-9 (2010) 
 
Sphingosine 1-phosphate receptor 1
Name:Sphingosine 1-phosphate receptor 1
Type:Enzyme
Mol. Mass.:42836.02
Organism:Homo sapiens (Human)
Description:P21453
Residue:382
BDBM50313315
NameBDBM50313315
Synonyms:6-(tert-butylamino)-N-(4-hydroxy-2-methylphenyl)pyrimidine-4-carboxamide | CHEMBL1081081
TypeSmall organic molecule
Emp. Form.C16H20N4O2
Mol. Mass.300.3556
SMILESCc1cc(O)ccc1NC(=O)c1cc(NC(C)(C)C)ncn1