Reaction Details
TargetSphingosine 1-phosphate receptor 1
LigandBDBM50313334
Substrate/Competitorn/a
Meas. Tech.ChEMBL_617125 (CHEMBL1101383)
EC50>20000±n/a nM
Citation Crosignani, SBombrun, ACovini, DMaio, MMarin, DQuattropani, ASwinnen, DSimpson, DSauer, WFrançon, BMartin, TCambet, YNichols, AMartinou, IBurgat-Charvillon, FRivron, DDonini, CSchott, OEligert, VNovo-Perez, LVitte, PAArrighi, JF Discovery of a novel series of potent S1P1 agonists. Bioorg Med Chem Lett20:1516-9 (2010) 
 
Sphingosine 1-phosphate receptor 1
Name:Sphingosine 1-phosphate receptor 1
Type:Enzyme
Mol. Mass.:42836.02
Organism:Homo sapiens (Human)
Description:P21453
Residue:382
BDBM50313334
NameBDBM50313334
Synonyms:CHEMBL1087140 | N-(4-acetamidophenyl)-6-(cyclohexylamino)pyrimidine-4-carboxamide
TypeSmall organic molecule
Emp. Form.C19H23N5O2
Mol. Mass.353.4182
SMILESCC(=O)Nc1ccc(NC(=O)c2cc(NC3CCCCC3)ncn2)cc1