Reaction Details
TargetSphingosine 1-phosphate receptor 1
LigandBDBM50313341
Substrate/Competitorn/a
Meas. Tech.ChEMBL_617125 (CHEMBL1101383)
EC50 193±n/a nM
Citation Crosignani, SBombrun, ACovini, DMaio, MMarin, DQuattropani, ASwinnen, DSimpson, DSauer, WFrançon, BMartin, TCambet, YNichols, AMartinou, IBurgat-Charvillon, FRivron, DDonini, CSchott, OEligert, VNovo-Perez, LVitte, PAArrighi, JF Discovery of a novel series of potent S1P1 agonists. Bioorg Med Chem Lett20:1516-9 (2010) 
 
Sphingosine 1-phosphate receptor 1
Name:Sphingosine 1-phosphate receptor 1
Type:Enzyme
Mol. Mass.:42836.02
Organism:Homo sapiens (Human)
Description:P21453
Residue:382
BDBM50313341
NameBDBM50313341
Synonyms:6-(cyclohexyl(cyclopropylmethyl)amino)-N-(4-(methylsulfonyl)phenyl)pyrimidine-4-carboxamide US9150519, 1-112
TypeSmall organic molecule
Emp. Form.C22H28N4O3S
Mol. Mass.428.548
SMILESCS(=O)(=O)c1ccc(NC(=O)c2cc(ncn2)N(CC2CC2)C2CCCCC2)cc1