Reaction Details
TargetSphingosine 1-phosphate receptor 1
LigandBDBM50313351
Substrate/Competitorn/a
Meas. Tech.ChEMBL_617125 (CHEMBL1101383)
EC50 7±n/a nM
Citation Crosignani, SBombrun, ACovini, DMaio, MMarin, DQuattropani, ASwinnen, DSimpson, DSauer, WFrançon, BMartin, TCambet, YNichols, AMartinou, IBurgat-Charvillon, FRivron, DDonini, CSchott, OEligert, VNovo-Perez, LVitte, PAArrighi, JF Discovery of a novel series of potent S1P1 agonists. Bioorg Med Chem Lett20:1516-9 (2010) 
 
Sphingosine 1-phosphate receptor 1
Name:Sphingosine 1-phosphate receptor 1
Type:Enzyme
Mol. Mass.:42836.02
Organism:Homo sapiens (Human)
Description:P21453
Residue:382
BDBM50313351
NameBDBM50313351
Synonyms:6-(dipropylamino)-N-(1H-indazol-5-yl)pyrimidine-4-carboxamide US9150519, 1-68
TypeSmall organic molecule
Emp. Form.C18H22N6O
Mol. Mass.338.4069
SMILESCCCN(CCC)c1cc(ncn1)C(=O)Nc1ccc2[nH]ncc2c1