Reaction Details
TargetSphingosine 1-phosphate receptor 1
LigandBDBM50313358
Substrate/Competitorn/a
Meas. Tech.ChEMBL_617125 (CHEMBL1101383)
EC50 33±n/a nM
Citation Crosignani, SBombrun, ACovini, DMaio, MMarin, DQuattropani, ASwinnen, DSimpson, DSauer, WFrançon, BMartin, TCambet, YNichols, AMartinou, IBurgat-Charvillon, FRivron, DDonini, CSchott, OEligert, VNovo-Perez, LVitte, PAArrighi, JF Discovery of a novel series of potent S1P1 agonists. Bioorg Med Chem Lett20:1516-9 (2010) 
 
Sphingosine 1-phosphate receptor 1
Name:Sphingosine 1-phosphate receptor 1
Type:Enzyme
Mol. Mass.:42836.02
Organism:Homo sapiens (Human)
Description:P21453
Residue:382
BDBM50313358
NameBDBM50313358
Synonyms:3-(4-(6-((cyclopropylmethyl)(propyl)amino)pyrimidine-4-carboxamido)-3-methylphenylsulfonamido)propanoic acid US9150519, 1-99
TypeSmall organic molecule
Emp. Form.C22H29N5O5S
Mol. Mass.475.561
SMILESCCCN(CC1CC1)c1cc(ncn1)C(=O)Nc1ccc(cc1C)S(=O)(=O)NCCC(O)=O