Reaction Details
TargetSphingosine 1-phosphate receptor 1
LigandBDBM50313362
Substrate/Competitorn/a
Meas. Tech.ChEMBL_617125 (CHEMBL1101383)
EC50 94±n/a nM
Citation Crosignani, SBombrun, ACovini, DMaio, MMarin, DQuattropani, ASwinnen, DSimpson, DSauer, WFrançon, BMartin, TCambet, YNichols, AMartinou, IBurgat-Charvillon, FRivron, DDonini, CSchott, OEligert, VNovo-Perez, LVitte, PAArrighi, JF Discovery of a novel series of potent S1P1 agonists. Bioorg Med Chem Lett20:1516-9 (2010) 
 
Sphingosine 1-phosphate receptor 1
Name:Sphingosine 1-phosphate receptor 1
Type:Enzyme
Mol. Mass.:42836.02
Organism:Homo sapiens (Human)
Description:P21453
Residue:382
BDBM50313362
NameBDBM50313362
Synonyms:2-((4-(6-(cyclohexyl(cyclopropylmethyl)amino)pyrimidine-4-carboxamido)benzyl)(methyl)amino)acetic acid US9150519, 1-81
TypeSmall organic molecule
Emp. Form.C25H33N5O3
Mol. Mass.451.5612
SMILESCN(CC(O)=O)Cc1ccc(NC(=O)c2cc(ncn2)N(CC2CC2)C2CCCCC2)cc1