Reaction Details
TargetSodium/glucose cotransporter 2
LigandBDBM50313366
Substrate/Competitorn/a
Meas. Tech.ChEMBL_617327 (CHEMBL1101142)
IC50>10000±n/a nM
Citation Robinson, RPMascitti, VBoustany-Kari, CMCarr, CLFoley, PMKimoto, ELeininger, MTLowe, AKlenotic, MKMacdonald, JIMaguire, RJMasterson, VMMaurer, TSMiao, ZPatel, JDPréville, CReese, MRShe, LSteppan, CMThuma, BAZhu, T C-Aryl glycoside inhibitors of SGLT2: Exploration of sugar modifications including C-5 spirocyclization. Bioorg Med Chem Lett20:1569-72 (2010) 
 
Sodium/glucose cotransporter 2
Name:Sodium/glucose cotransporter 2
Type:Protein
Mol. Mass.:72902.00
Organism:Homo sapiens (Human)
Description:P31639
Residue:672
BDBM50313366
NameBDBM50313366
Synonyms:(2R,3S,4R,6R)-6-(3-(4-ethylbenzyl)-4-methylphenyl)-2-(hydroxymethyl)tetrahydro-2H-pyran-3,4-diol | CHEMBL1085189
TypeSmall organic molecule
Emp. Form.C22H28O4
Mol. Mass.356.4553
SMILESCCc1ccc(Cc2cc(ccc2C)[C@H]2C[C@@H](O)[C@H](O)[C@@H](CO)O2)cc1