Reaction Details
TargetSodium/glucose cotransporter 1
LigandBDBM50313373
Substrate/Competitorn/a
Meas. Tech.ChEMBL_617326 (CHEMBL1100948)
IC50 1100±n/a nM
Citation Robinson, RPMascitti, VBoustany-Kari, CMCarr, CLFoley, PMKimoto, ELeininger, MTLowe, AKlenotic, MKMacdonald, JIMaguire, RJMasterson, VMMaurer, TSMiao, ZPatel, JDPréville, CReese, MRShe, LSteppan, CMThuma, BAZhu, T C-Aryl glycoside inhibitors of SGLT2: Exploration of sugar modifications including C-5 spirocyclization. Bioorg Med Chem Lett20:1569-72 (2010) 
 
Sodium/glucose cotransporter 1
Name:Sodium/glucose cotransporter 1
Type:Protein
Mol. Mass.:73503.78
Organism:Homo sapiens (Human)
Description:P13866
Residue:664
BDBM50313373
NameBDBM50313373
Synonyms:(5R,7S,8R,9R,10S)-7-(3-(4-ethylbenzyl)-4-methylphenyl)-1,6-dioxaspiro[4.5]decane-8,9,10-triol | CHEMBL1094714
TypeSmall organic molecule
Emp. Form.C24H30O5
Mol. Mass.398.492
SMILESCCc1ccc(Cc2cc(ccc2C)[C@@H]2O[C@]3(CCCO3)[C@@H](O)[C@H](O)[C@H]2O)cc1