Reaction Details
TargetSodium/glucose cotransporter 2
LigandBDBM50313378
Substrate/Competitorn/a
Meas. Tech.ChEMBL_617327 (CHEMBL1101142)
IC50 140±n/a nM
Citation Robinson, RPMascitti, VBoustany-Kari, CMCarr, CLFoley, PMKimoto, ELeininger, MTLowe, AKlenotic, MKMacdonald, JIMaguire, RJMasterson, VMMaurer, TSMiao, ZPatel, JDPréville, CReese, MRShe, LSteppan, CMThuma, BAZhu, T C-Aryl glycoside inhibitors of SGLT2: Exploration of sugar modifications including C-5 spirocyclization. Bioorg Med Chem Lett20:1569-72 (2010) 
 
Sodium/glucose cotransporter 2
Name:Sodium/glucose cotransporter 2
Type:Protein
Mol. Mass.:72902.00
Organism:Homo sapiens (Human)
Description:P31639
Residue:672
BDBM50313378
NameBDBM50313378
Synonyms:(2R,3S,4S,5R,6S)-6-(4-chloro-3-(4-methoxybenzyl)phenyl)-2-(hydroxymethyl)-5-methoxytetrahydro-2H-pyran-3,4-diol | CHEMBL1083834
TypeSmall organic molecule
Emp. Form.C21H25ClO6
Mol. Mass.408.873
SMILESCO[C@@H]1[C@@H](O)[C@H](O)[C@@H](CO)O[C@H]1c1ccc(Cl)c(Cc2ccc(OC)cc2)c1