Reaction Details
TargetSodium/glucose cotransporter 2
LigandBDBM50313382
Substrate/Competitorn/a
Meas. Tech.ChEMBL_617327 (CHEMBL1101142)
IC50 139±n/a nM
Citation Robinson, RPMascitti, VBoustany-Kari, CMCarr, CLFoley, PMKimoto, ELeininger, MTLowe, AKlenotic, MKMacdonald, JIMaguire, RJMasterson, VMMaurer, TSMiao, ZPatel, JDPréville, CReese, MRShe, LSteppan, CMThuma, BAZhu, T C-Aryl glycoside inhibitors of SGLT2: Exploration of sugar modifications including C-5 spirocyclization. Bioorg Med Chem Lett20:1569-72 (2010) 
 
Sodium/glucose cotransporter 2
Name:Sodium/glucose cotransporter 2
Type:Protein
Mol. Mass.:72902.00
Organism:Homo sapiens (Human)
Description:P31639
Residue:672
BDBM50313382
NameBDBM50313382
Synonyms:(2S,3R,4R,5R,6R)-2-(3-(4-ethylbenzyl)-4-methylphenyl)-6-(hydroxymethyl)tetrahydro-2H-pyran-3,4,5-triol | CHEMBL1085454
TypeSmall organic molecule
Emp. Form.C22H28O5
Mol. Mass.372.4547
SMILESCCc1ccc(Cc2cc(ccc2C)[C@@H]2O[C@H](CO)[C@H](O)[C@H](O)[C@H]2O)cc1