Reaction Details
TargetSodium/glucose cotransporter 2
LigandBDBM50313376
Substrate/Competitorn/a
Meas. Tech.ChEMBL_617327 (CHEMBL1101142)
IC50 5100±n/a nM
Citation Robinson, RPMascitti, VBoustany-Kari, CMCarr, CLFoley, PMKimoto, ELeininger, MTLowe, AKlenotic, MKMacdonald, JIMaguire, RJMasterson, VMMaurer, TSMiao, ZPatel, JDPréville, CReese, MRShe, LSteppan, CMThuma, BAZhu, T C-Aryl glycoside inhibitors of SGLT2: Exploration of sugar modifications including C-5 spirocyclization. Bioorg Med Chem Lett20:1569-72 (2010) 
 
Sodium/glucose cotransporter 2
Name:Sodium/glucose cotransporter 2
Type:Protein
Mol. Mass.:72902.00
Organism:Homo sapiens (Human)
Description:P31639
Residue:672
BDBM50313376
NameBDBM50313376
Synonyms:(6S,7R,8R,9S)-6-(3-(4-ethylbenzyl)-4-methylphenyl)-5-oxa-2-azaspiro[3.5]nonane-7,8,9-triol | CHEMBL1091809
TypeSmall organic molecule
Emp. Form.C23H29NO4
Mol. Mass.383.4807
SMILESCCc1ccc(Cc2cc(ccc2C)[C@@H]2OC3(CNC3)[C@@H](O)[C@H](O)[C@H]2O)cc1