Reaction Details
TargetSphingosine 1-phosphate receptor 1
LigandBDBM50313500
Substrate/Competitorn/a
Meas. Tech.ChEMBL_617665 (CHEMBL1101461)
EC50 110±n/a nM
Citation Högenauer, KHinterding, KNussbaumer, P S1P receptor mediated activity of FTY720 phosphate mimics. Bioorg Med Chem Lett20:1485-7 (2010) 
 
Sphingosine 1-phosphate receptor 1
Name:Sphingosine 1-phosphate receptor 1
Type:Enzyme
Mol. Mass.:42836.02
Organism:Homo sapiens (Human)
Description:P21453
Residue:382
BDBM50313500
NameBDBM50313500
Synonyms:(S)-3-amino-5-(4-(heptyloxy)phenyl)-3-methylpentane-1-sulfonic acid | CHEMBL1084930
TypeSmall organic molecule
Emp. Form.C19H33NO4S
Mol. Mass.371.535
SMILESCCCCCCCOc1ccc(CC[C@](C)(N)CCS(O)(=O)=O)cc1