Reaction Details
TargetSphingosine 1-phosphate receptor 2
LigandBDBM50313502
Substrate/Competitorn/a
Meas. Tech.ChEMBL_617666 (CHEMBL1101462)
IC50>22000±n/a nM
Citation Högenauer, KHinterding, KNussbaumer, P S1P receptor mediated activity of FTY720 phosphate mimics. Bioorg Med Chem Lett20:1485-7 (2010) 
 
Sphingosine 1-phosphate receptor 2
Name:Sphingosine 1-phosphate receptor 2
Type:G Protein-Coupled Receptor (GPCR)
Mol. Mass.:38883.16
Organism:Homo sapiens (Human)
Description:Membranes isolated from S1P2-transfected CHO cells were used in ligand binding assay.
Residue:353
BDBM50313502
NameBDBM50313502
Synonyms:(S)-4-amino-6-(4-(heptyloxy)phenyl)-4-methylhexanoic acid | CHEMBL1077288
TypeSmall organic molecule
Emp. Form.C20H33NO3
Mol. Mass.335.4809
SMILESCCCCCCCOc1ccc(CC[C@](C)(N)CCC(O)=O)cc1