Reaction Details
TargetSphingosine 1-phosphate receptor 2
LigandBDBM50313497
Substrate/Competitorn/a
Meas. Tech.ChEMBL_617666 (CHEMBL1101462)
IC50>22000±n/a nM
Citation Högenauer, KHinterding, KNussbaumer, P S1P receptor mediated activity of FTY720 phosphate mimics. Bioorg Med Chem Lett20:1485-7 (2010) 
 
Sphingosine 1-phosphate receptor 2
Name:Sphingosine 1-phosphate receptor 2
Type:G Protein-Coupled Receptor (GPCR)
Mol. Mass.:38883.16
Organism:Homo sapiens (Human)
Description:Membranes isolated from S1P2-transfected CHO cells were used in ligand binding assay.
Residue:353
BDBM50313497
NameBDBM50313497
Synonyms:(S)-1-(4-(heptyloxy)phenyl)-3-methyl-5-(1H-tetrazol-5-yl)pentan-3-amine | CHEMBL1085191
TypeSmall organic molecule
Emp. Form.C20H33N5O
Mol. Mass.359.5089
SMILESCCCCCCCOc1ccc(CC[C@](C)(N)CCc2nnn[nH]2)cc1