Reaction Details
TargetSphingosine 1-phosphate receptor 3
LigandBDBM50313498
Substrate/Competitorn/a
Meas. Tech.ChEMBL_617667 (CHEMBL1101463)
EC50 2400±n/a nM
Citation Högenauer, KHinterding, KNussbaumer, P S1P receptor mediated activity of FTY720 phosphate mimics. Bioorg Med Chem Lett20:1485-7 (2010) 
 
Sphingosine 1-phosphate receptor 3
Name:Sphingosine 1-phosphate receptor 3
Type:G Protein-Coupled Receptor (GPCR)
Mol. Mass.:42278.13
Organism:Homo sapiens (Human)
Description:Q99500
Residue:378
BDBM50313498
NameBDBM50313498
Synonyms:5-[(S)-3-Amino-5-(4-heptyloxy-phenyl)-3-methyl-pentyl]-1,1-dioxo-1lambda*6*-[1,2,5]thiadiazolidin-3-one | CHEMBL1083841
TypeSmall organic molecule
Emp. Form.C21H35N3O4S
Mol. Mass.425.585
SMILESCCCCCCCOc1ccc(CC[C@](C)(N)CCN2CC(=O)NS2(=O)=O)cc1