Reaction Details
TargetProtein kinase C theta type
LigandBDBM50313578
Substrate/Competitorn/a
Meas. Tech.ChEMBL_614192 (CHEMBL1105142)
IC50 1.3±n/a nM
Citation Boschelli, DHSubrath, JNiu, CWu, BWang, YLee, JBrennan, AHo, MDeng, BYang, XXu, XLeung, LWang, JAtherton, JChaudhary, D Optimization of 5-vinylaryl-3-pyridinecarbonitriles as PKCtheta inhibitors. Bioorg Med Chem Lett20:1965-8 (2010) 
 
Protein kinase C theta type
Name:Protein kinase C theta type
Type:Serine/threonine-protein kinase
Mol. Mass.:81878.04
Organism:Homo sapiens (Human)
Description:Full-length human PKC theta (Panvera Catalog No. P2996).
Residue:706
BDBM50313578
NameBDBM50313578
Synonyms:(E)-5-(4-((4-(dimethylamino)piperidin-1-yl)methyl)styryl)-4-(4-methyl-1H-indol-5-ylamino)nicotinonitrile | CHEMBL1088056
TypeSmall organic molecule
Emp. Form.C31H34N6
Mol. Mass.490.6419
SMILESCN(C)C1CCN(Cc2ccc(\C=C\c3cncc(C#N)c3Nc3ccc4[nH]ccc4c3C)cc2)CC1