Reaction Details
TargetProto-oncogene tyrosine-protein kinase Src
LigandBDBM50313645
Substrate/Competitorn/a
Meas. Tech.ChEMBL_614491 (CHEMBL1110559)
IC50 14±n/a nM
Citation Morphy, R Selectively nonselective kinase inhibition: striking the right balance. J Med Chem53:1413-37 (2010) 
 
Proto-oncogene tyrosine-protein kinase Src
Name:Proto-oncogene tyrosine-protein kinase Src
Type:Protein
Mol. Mass.:59838.60
Organism:Homo sapiens (Human)
Description:P12931
Residue:536
BDBM50313645
NameBDBM50313645
Synonyms:1-cyclopentyl-3-(1H-pyrrolo[2,3-b]pyridin-5-yl)-1H-pyrazolo[3,4-d]pyrimidin-4-amine | CHEMBL1081312
TypeSmall organic molecule
Emp. Form.C17H17N7
Mol. Mass.319.3638
SMILESNc1ncnc2n(nc(-c3cnc4[nH]ccc4c3)c12)C1CCCC1