Reaction Details
TargetRAC-alpha serine/threonine-protein kinase
LigandBDBM24989
Substrate/Competitorn/a
Meas. Tech.ChEMBL_614504 (CHEMBL1111477)
IC50 79±n/a nM
Citation Morphy, R Selectively nonselective kinase inhibition: striking the right balance. J Med Chem53:1413-37 (2010) 
 
RAC-alpha serine/threonine-protein kinase
Name:RAC-alpha serine/threonine-protein kinase
Type:Enzyme
Mol. Mass.:55681.25
Organism:Homo sapiens (Human)
Description:P31749
Residue:480
BDBM24989
NameBDBM24989
Synonyms:4-[1-ethyl-7-(piperidin-4-yloxy)-1H-imidazo[4,5-c]pyridin-2-yl]-1,2,5-oxadiazol-3-amine | oxadiazole-containing compound, 1
TypeSmall organic molecule
Emp. Form.C15H19N7O2
Mol. Mass.329.3571
SMILESCCn1c(nc2cncc(OC3CCNCC3)c12)-c1nonc1N