Reaction Details
TargetRAC-alpha serine/threonine-protein kinase
LigandBDBM50313649
Substrate/Competitorn/a
Meas. Tech.ChEMBL_614504 (CHEMBL1111477)
IC50 273±n/a nM
Citation Morphy, R Selectively nonselective kinase inhibition: striking the right balance. J Med Chem53:1413-37 (2010) 
 
RAC-alpha serine/threonine-protein kinase
Name:RAC-alpha serine/threonine-protein kinase
Type:Enzyme
Mol. Mass.:55681.25
Organism:Homo sapiens (Human)
Description:P31749
Residue:480
BDBM50313649
NameBDBM50313649
Synonyms:1-(1-(4-(5-(1-methyl-1H-tetrazol-5-yl)-3-phenylpyridin-2-yl)benzyl)piperidin-4-yl)-1H-benzo[d]imidazol-2(3H)-one CHEMBL182101
TypeSmall organic molecule
Emp. Form.C32H30N8O
Mol. Mass.542.6336
SMILESCn1nnnc1-c1cnc(-c2ccc(CN3CCC(CC3)n3c4ccccc4[nH]c3=O)cc2)c(c1)-c1ccccc1