Reaction Details
TargetRho-associated protein kinase 1
LigandBDBM25014
Substrate/Competitorn/a
Meas. Tech.ChEMBL_614512 (CHEMBL1111485)
IC50 890±n/a nM
Citation Morphy, R Selectively nonselective kinase inhibition: striking the right balance. J Med Chem53:1413-37 (2010) 
 
Rho-associated protein kinase 1
Name:Rho-associated protein kinase 1
Type:Serine/threonine-protein kinase
Mol. Mass.:158156.77
Organism:Homo sapiens (Human)
Description:Q13464
Residue:1354
BDBM25014
NameBDBM25014
Synonyms:4-[2-(4-amino-1,2,5-oxadiazol-3-yl)-1-ethyl-7-[(3R)-piperidin-3-ylmethoxy]-1H-imidazo[4,5-c]pyridin-4-yl]-2-methylbut-3-yn-2-ol | oxadiazole-containing compound, 3h
TypeSmall organic molecule
Emp. Form.C21H27N7O3
Mol. Mass.425.4842
SMILESCCn1c(nc2c(ncc(OC[C@@H]3CCCNC3)c12)C#CC(C)(C)O)-c1nonc1N