Reaction Details
TargetGlycogen synthase kinase-3 beta
LigandBDBM50313697
Substrate/Competitorn/a
Meas. Tech.ChEMBL_614756 (CHEMBL1113275)
IC50 12±n/a nM
Citation Lesuisse, DDutruc-Rosset, GTiraboschi, GDreyer, MKMaignan, SChevalier, AHalley, FBertrand, PBurgevin, MCQuarteronet, DRooney, T Rational design of potent GSK3beta inhibitors with selectivity for Cdk1 and Cdk2. Bioorg Med Chem Lett20:1985-9 (2010) 
 
Glycogen synthase kinase-3 beta
Name:Glycogen synthase kinase-3 beta
Type:Enzyme
Mol. Mass.:46756.38
Organism:Homo sapiens (Human)
Description:P49841
Residue:420
BDBM50313697
NameBDBM50313697
Synonyms:CHEMBL1097003 | N-(6,7-dichloro-5-phenyl-1H-indazol-3-yl)butyramide
TypeSmall organic molecule
Emp. Form.C17H15Cl2N3O
Mol. Mass.348.227
SMILESCCCC(=O)Nc1n[nH]c2c(Cl)c(Cl)c(cc12)-c1ccccc1