Reaction Details
TargetDNA polymerase alpha catalytic subunit
LigandBDBM50313784
Substrate/Competitorn/a
Meas. Tech.ChEMBL_614964 (CHEMBL1116841)
IC50 5000±n/a nM
Citation Tanis, SPStrohbach, JWParker, TTMoon, MWThaisrivongs, SPerrault, WRHopkins, TAKnechtel, MLOien, NLWieber, JLStephanski, KJWathen, MW The design and development of 2-aryl-2-hydroxy ethylamine substituted 1H,7H-pyrido[1,2,3-de]quinoxaline-6-carboxamides as inhibitors of human cytomegalovirus polymerase. Bioorg Med Chem Lett20:1994-2000 (2010) 
 
DNA polymerase alpha catalytic subunit
Name:DNA polymerase alpha catalytic subunit
Type:PROTEIN
Mol. Mass.:165895.25
Organism:Homo sapiens (Human)
Description:ChEMBL_1365493
Residue:1462
BDBM50313784
NameBDBM50313784
Synonyms:(R)-9-(((2-(benzofuran-2-yl)-2-hydroxyethyl)(methyl)amino)methyl)-N-(4-chlorobenzyl)-1-methyl-2,7-dioxo-1,2,3,7-tetrahydropyrido[1,2,3-de]quinoxaline-6-carboxamide | CHEMBL1077295
TypeSmall organic molecule
Emp. Form.C32H29ClN4O5
Mol. Mass.585.049
SMILESCN(C[C@@H](O)c1cc2ccccc2o1)Cc1cc2N(C)C(=O)Cn3cc(C(=O)NCc4ccc(Cl)cc4)c(=O)c(c1)c23