Reaction Details
TargetOxytocin receptor
LigandBDBM50313812
Substrate/Competitorn/a
Meas. Tech.ChEMBL_615224 (CHEMBL1115874)
Ki 36.7±n/a nM
Citation Brown, AEllis, DWallace, ORalph, M Identification of a urea bioisostere of a triazole oxytocin antagonist. Bioorg Med Chem Lett20:1851-3 (2010) 
 
Oxytocin receptor
Name:Oxytocin receptor
Type:Enzyme Catalytic Domain
Mol. Mass.:42793.26
Organism:Homo sapiens (Human)
Description:Oxytocin OXTR HEK293::B2R9L7
Residue:389
BDBM50313812
NameBDBM50313812
Synonyms:3-(3,5-difluoro-2-methylphenoxy)-N-ethyl-N-(6-methoxypyridin-3-yl)azetidine-1-carboxamide | CHEMBL1093744
TypeSmall organic molecule
Emp. Form.C19H21F2N3O3
Mol. Mass.377.3851
SMILESCCN(C(=O)N1CC(C1)Oc1cc(F)cc(F)c1C)c1ccc(OC)nc1