Reaction Details
TargetOxytocin receptor
LigandBDBM50305523
Substrate/Competitorn/a
Meas. Tech.ChEMBL_615224 (CHEMBL1115874)
Ki 28.4±n/a nM
Citation Brown, AEllis, DWallace, ORalph, M Identification of a urea bioisostere of a triazole oxytocin antagonist. Bioorg Med Chem Lett20:1851-3 (2010) 
 
Oxytocin receptor
Name:Oxytocin receptor
Type:Enzyme Catalytic Domain
Mol. Mass.:42793.26
Organism:Homo sapiens (Human)
Description:Oxytocin OXTR HEK293::B2R9L7
Residue:389
BDBM50305523
NameBDBM50305523
Synonyms:5-(3-(3-(2-chloro-4-fluorophenoxy)azetidin-1-yl)-5-methyl-4H-1,2,4-triazol-4-yl)-2-methoxypyridine | CHEMBL589125
TypeSmall organic molecule
Emp. Form.C18H17ClFN5O2
Mol. Mass.389.811
SMILESCOc1ccc(cn1)-n1c(C)nnc1N1CC(C1)Oc1ccc(F)cc1Cl