Reaction Details
TargetCorticotropin-releasing factor receptor 1
LigandBDBM50300145
Substrate/Competitorn/a
Meas. Tech.ChEMBL_615438 (CHEMBL1106905)
IC50 0.24±n/a nM
Citation Hartz, RAAhuja, VTSchmitz, WDMolski, TFMattson, GKLodge, NJBronson, JJMacor, JE Synthesis and structure-activity relationships of N3-pyridylpyrazinones as corticotropin-releasing factor-1 (CRF1) receptor antagonists. Bioorg Med Chem Lett20:1890-4 (2010) 
 
Corticotropin-releasing factor receptor 1
Name:Corticotropin-releasing factor receptor 1
Type:G Protein-Coupled Receptor (GPCR)
Mol. Mass.:47870.75
Organism:Rattus norvegicus (rat)
Description:Receptor binding assays were performed using rat cortex homogenate.
Residue:415
BDBM50300145
NameBDBM50300145
Synonyms:(S)-5-Chloro-1-(cyclopropyl-2-methoxyethyl)-3-[6-(difluoromethoxy)-2,5-dimethylpyridin-3-ylamino]pyrazin-2(1H)-one CHEMBL574852
TypeSmall organic molecule
Emp. Form.C18H21ClF2N4O3
Mol. Mass.414.834
SMILESCOC[C@H](C1CC1)n1cc(Cl)nc(Nc2cc(C)c(OC(F)F)nc2C)c1=O