Reaction Details
TargetBeta-secretase 1
LigandBDBM50313897
Substrate/Competitorn/a
Meas. Tech.ChEMBL_615460 (CHEMBL1107778)
IC50 310±n/a nM
Citation Rajapakse, HANantermet, PGSelnick, HGBarrow, JCMcGaughey, GBMunshi, SLindsley, SRYoung, MBNgo, PLHolloway, MKLai, MTEspeseth, ASShi, XPColussi, DPietrak, BCrouthamel, MCTugusheva, KHuang, QXu, MSimon, AJKuo, LHazuda, DJGraham, SVacca, JP SAR of tertiary carbinamine derived BACE1 inhibitors: role of aspartate ligand amine pKa in enzyme inhibition. Bioorg Med Chem Lett20:1885-9 (2010) 
 
Beta-secretase 1
Name:Beta-secretase 1
Type:Protein
Mol. Mass.:55755.10
Organism:Homo sapiens (Human)
Description:P56817
Residue:501
BDBM50313897
NameBDBM50313897
Synonyms:3-((R)-1-(4-fluorophenyl)ethylcarbamoyl)-5-(N-methylmethylsulfonamido)benzyl 2-amino-2-benzyl-3-hydroxypropanoate | CHEMBL1082547
TypeSmall organic molecule
Emp. Form.C28H32FN3O6S
Mol. Mass.557.634
SMILESC[C@@H](NC(=O)c1cc(COC(=O)C(N)(CO)Cc2ccccc2)cc(c1)N(C)S(C)(=O)=O)c1ccc(F)cc1