Reaction Details
TargetBeta-secretase 1
LigandBDBM50313894
Substrate/Competitorn/a
Meas. Tech.ChEMBL_615460 (CHEMBL1107778)
IC50 822±n/a nM
Citation Rajapakse, HANantermet, PGSelnick, HGBarrow, JCMcGaughey, GBMunshi, SLindsley, SRYoung, MBNgo, PLHolloway, MKLai, MTEspeseth, ASShi, XPColussi, DPietrak, BCrouthamel, MCTugusheva, KHuang, QXu, MSimon, AJKuo, LHazuda, DJGraham, SVacca, JP SAR of tertiary carbinamine derived BACE1 inhibitors: role of aspartate ligand amine pKa in enzyme inhibition. Bioorg Med Chem Lett20:1885-9 (2010) 
 
Beta-secretase 1
Name:Beta-secretase 1
Type:Protein
Mol. Mass.:55755.10
Organism:Homo sapiens (Human)
Description:P56817
Residue:501
BDBM50313894
NameBDBM50313894
Synonyms:3-(5-((R)-2-amino-1-phenylpropan-2-yl)-1H-1,2,4-triazol-3-yl)-N-((R)-1-(4-fluorophenyl)ethyl)-5-(N-methylmethylsulfonamido)benzamide | CHEMBL1092147
TypeSmall organic molecule
Emp. Form.C28H31FN6O3S
Mol. Mass.550.648
SMILESC[C@@H](NC(=O)c1cc(cc(c1)-c1nnc([nH]1)[C@](C)(N)Cc1ccccc1)N(C)S(C)(=O)=O)c1ccc(F)cc1