Reaction Details
TargetBeta-secretase 1
LigandBDBM16041
Substrate/Competitorn/a
Meas. Tech.ChEMBL_615459 (CHEMBL1107777)
pH7.2±n/a
IC50 60±n/a nM
Commentsextracted
Citation Rajapakse, HANantermet, PGSelnick, HGBarrow, JCMcGaughey, GBMunshi, SLindsley, SRYoung, MBNgo, PLHolloway, MKLai, MTEspeseth, ASShi, XPColussi, DPietrak, BCrouthamel, MCTugusheva, KHuang, QXu, MSimon, AJKuo, LHazuda, DJGraham, SVacca, JP SAR of tertiary carbinamine derived BACE1 inhibitors: role of aspartate ligand amine pKa in enzyme inhibition. Bioorg Med Chem Lett20:1885-9 (2010) 
 
Beta-secretase 1
Name:Beta-secretase 1
Type:Protein
Mol. Mass.:55755.10
Organism:Homo sapiens (Human)
Description:P56817
Residue:501
BDBM16041
NameBDBM16041
Synonyms:3-{5-[(1R)-1-amino-1-methyl-2-phenylethyl]-1,3,4-oxadiazol-2-yl}-N-[(1R)-1-(4-fluorophenyl)ethyl]-5-[methyl(methylsulfonyl)amino]benzamide CHEMBL219601 oxadiazoyl tertiary carbinamine 8
TypeSmall organic molecule
Emp. Form.C28H30FN5O4S
Mol. Mass.551.632
SMILESC[C@@H](NC(=O)c1cc(cc(c1)-c1nnc(o1)[C@](C)(N)Cc1ccccc1)N(C)S(C)(=O)=O)c1ccc(F)cc1