Reaction Details
TargetD(1B) dopamine receptor
LigandBDBM50313916
Substrate/Competitorn/a
Meas. Tech.ChEMBL_615498 (CHEMBL1105128)
Ki 10.3±n/a nM
Citation Robaa, DEnzensperger, CAbul Azm, Sel DEl Khawass, el SEl Sayed, OLehmann, J Dopamine receptor ligands. Part 18: (1) modification of the structural skeleton of indolobenzazecine-type dopamine receptor antagonists. J Med Chem53:2646-50 (2010) 
 
D(1B) dopamine receptor
Name:D(1B) dopamine receptor
Type:Protein
Mol. Mass.:52943.41
Organism:Homo sapiens (Human)
Description:P21918
Residue:477
BDBM50313916
NameBDBM50313916
Synonyms:7-Methyl-6,7,8,9,10,15-hexahydroindolo[2,3-f][3]benzazecine | CHEMBL1087301
TypeSmall organic molecule
Emp. Form.C20H22N2
Mol. Mass.290.4021
SMILESCN1CCc2[nH]c3ccccc3c2Cc2ccccc2CC1