Reaction Details
TargetCytochrome P450 3A4
LigandBDBM50313976
Substrate/Competitorn/a
Meas. Tech.ChEMBL_615729 (CHEMBL1100504)
IC50>100000±n/a nM
Citation Shen, HCDing, FXRaghavan, SDeng, QLuell, SForrest, MJCarballo-Jane, EWilsie, LCKrsmanovic, MLTaggart, AKWu, KKWu, TJCheng, KRen, NCai, TQChen, QWang, JWolff, MSTong, XHolt, TGWaters, MGHammond, MLTata, JRColletti, SL Discovery of a biaryl cyclohexene carboxylic acid (MK-6892): a potent and selective high affinity niacin receptor full agonist with reduced flushing profiles in animals as a preclinical candidate. J Med Chem53:2666-70 (2010) 
 
Cytochrome P450 3A4
Name:Cytochrome P450 3A4
Type:Enzyme
Mol. Mass.:57349.57
Organism:Homo sapiens (Human)
Description:n/a
Residue:503
BDBM50313976
NameBDBM50313976
Synonyms:2-({3-[3-(5-hydroxypyridin-2-yl)-1,2,4-oxadiazol-5-yl]-2,2-dimethylpropanoyl}-amino)cyclohex-1-ene-1-carboxylic acid | CHEMBL1086657
TypeSmall organic molecule
Emp. Form.C19H22N4O5
Mol. Mass.386.4018
SMILESCC(C)(Cc1nc(no1)-c1ccc(O)cn1)C(=O)NC1=C(CCCC1)C(O)=O