Reaction Details
TargetHydroxycarboxylic acid receptor 2
LigandBDBM23533
Substrate/Competitorn/a
Meas. Tech.ChEMBL_615513 (CHEMBL1105991)
EC50 27±n/a nM
Citation Shen, HCDing, FXRaghavan, SDeng, QLuell, SForrest, MJCarballo-Jane, EWilsie, LCKrsmanovic, MLTaggart, AKWu, KKWu, TJCheng, KRen, NCai, TQChen, QWang, JWolff, MSTong, XHolt, TGWaters, MGHammond, MLTata, JRColletti, SL Discovery of a biaryl cyclohexene carboxylic acid (MK-6892): a potent and selective high affinity niacin receptor full agonist with reduced flushing profiles in animals as a preclinical candidate. J Med Chem53:2666-70 (2010) 
 
Hydroxycarboxylic acid receptor 2
Name:Hydroxycarboxylic acid receptor 2
Type:G Protein-Coupled Receptor (GPCR)
Mol. Mass.:41868.22
Organism:Homo sapiens (Human)
Description:Membranes from CHO cells expressing the recombinant human GPR109A were used in competition binding assay.
Residue:363
BDBM23533
NameBDBM23533
Synonyms:2-{3-[3-(5-hydroxypyridin-2-yl)-1,2,4-oxadiazol-5-yl]propanamido}benzoic acid | Biaryl Anthranilide Analogue, 2o
TypeSmall organic molecule
Emp. Form.C17H14N4O5
Mol. Mass.354.3169
SMILESOC(=O)c1ccccc1NC(=O)CCc1nc(no1)-c1ccc(O)cn1