Reaction Details
TargetProto-oncogene tyrosine-protein kinase Src
LigandBDBM50314051
Substrate/Competitorn/a
Meas. Tech.ChEMBL_627132 (CHEMBL1110869)
IC50>50000±n/a nM
Citation Gopalsamy, ACiszewski, GShi, MBerger, DHu, YLee, FFeldberg, LFrommer, EKim, SCollins, KWojciechowicz, DMallon, R Hit to lead optimization of pyrazolo[1,5-a]pyrimidines as B-Raf kinase inhibitors. Bioorg Med Chem Lett19:6890-2 (2009) 
 
Proto-oncogene tyrosine-protein kinase Src
Name:Proto-oncogene tyrosine-protein kinase Src
Type:Protein
Mol. Mass.:59838.60
Organism:Homo sapiens (Human)
Description:P12931
Residue:536
BDBM50314051
NameBDBM50314051
Synonyms:CHEMBL1089082 | N-(3-(2-(pyridin-4-yl)pyrazolo[1,5-a]pyrimidin-7-yl)phenyl)-3-(trifluoromethyl)benzamide
TypeSmall organic molecule
Emp. Form.C25H16F3N5O
Mol. Mass.459.4226
SMILESFC(F)(F)c1cccc(c1)C(=O)Nc1cccc(c1)-c1ccnc2cc(nn12)-c1ccncc1