Reaction Details
TargetSerine/threonine-protein kinase mTOR
LigandBDBM50314051
Substrate/Competitorn/a
Meas. Tech.ChEMBL_627143 (CHEMBL1110880)
IC50>50000±n/a nM
Citation Gopalsamy, ACiszewski, GShi, MBerger, DHu, YLee, FFeldberg, LFrommer, EKim, SCollins, KWojciechowicz, DMallon, R Hit to lead optimization of pyrazolo[1,5-a]pyrimidines as B-Raf kinase inhibitors. Bioorg Med Chem Lett19:6890-2 (2009) 
 
Serine/threonine-protein kinase mTOR
Name:Serine/threonine-protein kinase mTOR
Type:Rapamycin target protein
Mol. Mass.:288917.12
Organism:Homo sapiens (Human)
Description:P42345
Residue:2549
BDBM50314051
NameBDBM50314051
Synonyms:CHEMBL1089082 | N-(3-(2-(pyridin-4-yl)pyrazolo[1,5-a]pyrimidin-7-yl)phenyl)-3-(trifluoromethyl)benzamide
TypeSmall organic molecule
Emp. Form.C25H16F3N5O
Mol. Mass.459.4226
SMILESFC(F)(F)c1cccc(c1)C(=O)Nc1cccc(c1)-c1ccnc2cc(nn12)-c1ccncc1