Reaction Details
TargetMitogen-activated protein kinase 14
LigandBDBM50266947
Substrate/Competitorn/a
Meas. Tech.ChEMBL_627174 (CHEMBL1114528)
IC50 9±n/a nM
Citation Goldstein, DMKuglstatter, ALou, YSoth, MJ Selective p38alpha inhibitors clinically evaluated for the treatment of chronic inflammatory disorders. J Med Chem53:2345-53 (2010) 
 
Mitogen-activated protein kinase 14
Name:Mitogen-activated protein kinase 14
Type:Serine/threonine-protein kinase
Mol. Mass.:41286.76
Organism:Homo sapiens (Human)
Description:Q16539
Residue:360
BDBM50266947
NameBDBM50266947
Synonyms:2-(6-chloro-5-((2R,5S)-4-(4-fluorobenzyl)-2,5-dimethylpiperazine-1-carbonyl)-1-methyl-1H-indol-3-yl)-N,N-dimethyl-2-oxoacetamide CHEMBL514201 | talmapimod
TypeSmall organic molecule
Emp. Form.C27H30ClFN4O3
Mol. Mass.513.004
SMILESC[C@H]1CN([C@H](C)CN1Cc1ccc(F)cc1)C(=O)c1cc2c(cn(C)c2cc1Cl)C(=O)C(=O)N(C)C