Reaction Details
TargetMitogen-activated protein kinase 14
LigandBDBM15244
Substrate/Competitorn/a
Meas. Tech.ChEMBL_627174 (CHEMBL1114528)
IC50 10±n/a nM
Citation Goldstein, DMKuglstatter, ALou, YSoth, MJ Selective p38alpha inhibitors clinically evaluated for the treatment of chronic inflammatory disorders. J Med Chem53:2345-53 (2010) 
 
Mitogen-activated protein kinase 14
Name:Mitogen-activated protein kinase 14
Type:Serine/threonine-protein kinase
Mol. Mass.:41286.76
Organism:Homo sapiens (Human)
Description:Q16539
Residue:360
BDBM15244
NameBDBM15244
Synonyms:5-(2,6-dichlorophenyl)-2-(2,4-difluorophenyl)sulfanylpyrimido[1,6-b]pyridazin-6-one 5-(2,6-dichlorophenyl)-2-[(2,4-difluorophenyl)thio]-6-pyrimido[1,6-b]pyridazinone 5-(2,6-dichlorophenyl)-9-(2,4-difluorophenyl)sulfanyl-1,3,10-triazabicyclo[4.4.0]deca-2,5,7,9-tetraen-4-one VX-745 cid_3038525
TypeSmall organic molecule
Emp. Form.C19H9Cl2F2N3OS
Mol. Mass.436.262
SMILESFc1ccc(Sc2ccc3c(-c4c(Cl)cccc4Cl)c(=O)ncn3n2)c(F)c1