Reaction Details
TargetMitogen-activated protein kinase 8
LigandBDBM50314070
Substrate/Competitorn/a
Meas. Tech.ChEMBL_627170 (CHEMBL1111812)
Kd 190±n/a nM
Citation Goldstein, DMKuglstatter, ALou, YSoth, MJ Selective p38alpha inhibitors clinically evaluated for the treatment of chronic inflammatory disorders. J Med Chem53:2345-53 (2010) 
 
Mitogen-activated protein kinase 8
Name:Mitogen-activated protein kinase 8
Type:Enzyme
Mol. Mass.:48297.57
Organism:Homo sapiens (Human)
Description:JNK-1 was purchased from Upstate Cell Signaling Solutions (formerly Upstate Biotechnology).
Residue:427
BDBM50314070
NameBDBM50314070
Synonyms:6-(2,4-difluorophenoxy)-2-{[3-hydroxy-1-(2-hydroxyethyl)propyl]amino}-8-methylpyrido[2,3-d]pyrimidin-7(8H)-one pamapimod
TypeSmall organic molecule
Emp. Form.C19H20F2N4O4
Mol. Mass.406.3833
SMILESCn1c2nc(NC(CCO)CCO)ncc2cc(Oc2ccc(F)cc2F)c1=O