Reaction Details
TargetMitogen-activated protein kinase 10
LigandBDBM50314071
Substrate/Competitorn/a
Meas. Tech.ChEMBL_627166 (CHEMBL1111808)
Kd 780±n/a nM
Citation Goldstein, DMKuglstatter, ALou, YSoth, MJ Selective p38alpha inhibitors clinically evaluated for the treatment of chronic inflammatory disorders. J Med Chem53:2345-53 (2010) 
 
Mitogen-activated protein kinase 10
Name:Mitogen-activated protein kinase 10
Type:Enzyme
Mol. Mass.:52586.89
Organism:Homo sapiens (Human)
Description:n/a
Residue:464
BDBM50314071
NameBDBM50314071
Synonyms:2-(2,4-difluorophenyl)-6-(1-(2,6-difluorophenyl)ureido)nicotinamide VX-702
TypeSmall organic molecule
Emp. Form.C19H12F4N4O2
Mol. Mass.404.3178
SMILESNC(=O)N(c1ccc(C(N)=O)c(n1)-c1ccc(F)cc1F)c1c(F)cccc1F