Reaction Details
TargetCytochrome P450 1A2
LigandBDBM50314108
Substrate/Competitorn/a
Meas. Tech.ChEMBL_627649 (CHEMBL1114479)
IC50>100000±n/a nM
Citation Debenham, JSMadsen-Duggan, CBToupence, RBWalsh, TFWang, JTong, XKumar, SLao, JFong, TMXiao, JCHuang, CRShen, CPFeng, YMarsh, DJStribling, DSShearman, LPStrack, AMGoulet, MT Furo[2,3-b]pyridine-based cannabinoid-1 receptor inverse agonists: synthesis and biological evaluation. Part 1. Bioorg Med Chem Lett20:1448-52 (2010) 
 
Cytochrome P450 1A2
Name:Cytochrome P450 1A2
Type:Enzyme
Mol. Mass.:58423.38
Organism:Homo sapiens (Human)
Description:P05177
Residue:516
BDBM50314108
NameBDBM50314108
Synonyms:CHEMBL1092169 | N-(6-(2-chlorophenyl)-5-(4-chlorophenyl)-2-(2-hydroxy-2-methylpropanoyl)furo[2,3-b]pyridin-3-yl)-2-hydroxyacetamide
TypeSmall organic molecule
Emp. Form.C25H20Cl2N2O5
Mol. Mass.499.343
SMILESCC(C)(O)C(=O)c1oc2nc(-c3ccccc3Cl)c(cc2c1NC(=O)CO)-c1ccc(Cl)cc1