Reaction Details
TargetCannabinoid receptor 2
LigandBDBM50314109
Substrate/Competitorn/a
Meas. Tech.ChEMBL_627676 (CHEMBL1115256)
IC50 1000±n/a nM
Citation Debenham, JSMadsen-Duggan, CBToupence, RBWalsh, TFWang, JTong, XKumar, SLao, JFong, TMXiao, JCHuang, CRShen, CPFeng, YMarsh, DJStribling, DSShearman, LPStrack, AMGoulet, MT Furo[2,3-b]pyridine-based cannabinoid-1 receptor inverse agonists: synthesis and biological evaluation. Part 1. Bioorg Med Chem Lett20:1448-52 (2010) 
 
Cannabinoid receptor 2
Name:Cannabinoid receptor 2
Type:G Protein-Coupled Receptor (GPCR)
Mol. Mass.:39690.94
Organism:Homo sapiens (Human)
Description:P34972
Residue:360
BDBM50314109
NameBDBM50314109
Synonyms:1-(3-amino-5-(4-chlorophenyl)-6-(2,4-dichlorophenyl)furo[2,3-b]pyridin-2-yl)ethanone | CHEMBL1091466
TypeSmall organic molecule
Emp. Form.C21H13Cl3N2O2
Mol. Mass.431.699
SMILESCC(=O)c1oc2nc(-c3ccc(Cl)cc3Cl)c(cc2c1N)-c1ccc(Cl)cc1